Reaction Details
TargetPlasminogen
LigandBDBM17298
Substrate/CompetitorBDBM17296
Meas. Tech.Determination of Inhibition Constants
pH8±n/a
Temperature310.15±n/a K
Ki 13000±n/a nM
Citation Nar, HBauer, MSchmid, AStassen, JMWienen, WPriepke, HWKauffmann, IKRies, UJHauel, NH Structural basis for inhibition promiscuity of dual specific thrombin and factor Xa blood coagulation inhibitors. Structure9:29-37 (2001) 
 
Plasminogen
Name:Plasminogen
Type:Enzyme
Mol. Mass.:90579.18
Organism:Homo sapiens (Human)
Description:n/a
Residue:810
BDBM17298
BDBM17296
NameBDBM17298
Synonyms:4-[({1-methyl-5-[1-(pyrrolidin-1-ylcarbonyl)cyclopropyl]-1H-1,3-benzodiazol-2-yl}methyl)amino]benzene-1-carboximidamide | BIBM1015
TypeSmall organic molecule
Emp. Form.C24H28N6O
Mol. Mass.416.5187
SMILESCn1c(CNc2ccc(cc2)C(N)=N)nc2cc(ccc12)C1(CC1)C(=O)N1CCCC1