Reaction Details
TargetInterleukin-1 receptor-associated kinase 1 [194-712]
LigandBDBM355852
Substrate/Competitorn/a
Meas. Tech.Enzymatic Assay
IC50<100±n/a nM
Citation Chen, XYu, HLan, RJorand-Lebrun, CJohnson, TLGoutopoulos, A Macrocyclic compounds as IRAK1/4 inhibitors and uses thereof US Patent US9815836 Publication Date 11/14/2017
 
Interleukin-1 receptor-associated kinase 1 [194-712]
Name:Interleukin-1 receptor-associated kinase 1 [194-712]
Type:Enzyme Catalytic Domain
Mol. Mass.:55943.99
Organism:Homo sapiens (Human)
Description:aa 194-712
Residue:519
BDBM355852
NameBDBM355852
Synonyms:US9815836, Compound 38
TypeSmall organic molecule
Emp. Form.C20H19N7O2
Mol. Mass.389.4106
SMILESCn1cc2NC(=O)c3cccc(n3)-c3cnn(CC#CCCCNC(=O)c2n1)c3