Reaction Details
TargetHepatocyte growth factor receptor
LigandBDBM355873
Substrate/Competitorn/a
Meas. Tech.Kinase Assay
IC50<40±n/a nM
Citation Baik, TGJung, WKim, SIKim, SCPark, SKJung, SYJi, SHKi, SYKim, MCLee, EYHong, EM Protein kinase inhibitor containing pyrrolopyridazine derivative US Patent US9815840 Publication Date 11/14/2017
 
Hepatocyte growth factor receptor
Name:Hepatocyte growth factor receptor
Type:Protein
Mol. Mass.:155559.73
Organism:Homo sapiens (Human)
Description:P08581
Residue:1390
BDBM355873
NameBDBM355873
Synonyms:N-(4-((5-(3-((ethylamino)methyl)phenyl)pyrrolo[1,2-b]pyridazin-4-yl)oxy)-3-fluorophenyl)-N-(4-fluorophenyl)cyclopropane-1,1-dicarboxamide | US9815840, Example 81
TypeSmall organic molecule
Emp. Form.C33H29F2N5O3
Mol. Mass.581.6119
SMILESCCNCc1cccc(c1)-c1ccn2nccc(Oc3ccc(NC(=O)C4(CC4)C(=O)Nc4ccc(F)cc4)cc3F)c12