Reaction Details
TargetMucosa-associated lymphoid tissue lymphoma translocation protein 1
LigandBDBM50169049
Substrate/Competitorn/a
Meas. Tech.Biochemical Assay
IC50 0.002±n/a nM
Citation Soldermann, CPQuancard, JSchlapbach, ASimic, OTintelnot-Blomley, MZoller, T Pyrazolo pyrimidine derivatives and their use as MALT1 inhibitors US Patent US9815842 Publication Date 11/14/2017
 
Mucosa-associated lymphoid tissue lymphoma translocation protein 1
Name:Mucosa-associated lymphoid tissue lymphoma translocation protein 1
Type:Enzyme
Mol. Mass.:92257.81
Organism:Homo sapiens (Human)
Description:Q9UDY8
Residue:824
BDBM50169049
NameBDBM50169049
Synonyms:CHEMBL3806155 US9815842, Example 1
TypeSmall organic molecule
Emp. Form.C18H15ClF3N9O2
Mol. Mass.481.819
SMILESCO[C@@H](C)c1c(NC(=O)Nc2cnc(c(c2)C(F)(F)F)-n2nccn2)cnc2cc(Cl)nn12