Reaction Details
TargetMucosa-associated lymphoid tissue lymphoma translocation protein 1
LigandBDBM355965
Substrate/Competitorn/a
Meas. Tech.Biochemical Assay
IC50 0.003±n/a nM
Citation Soldermann, CPQuancard, JSchlapbach, ASimic, OTintelnot-Blomley, MZoller, T Pyrazolo pyrimidine derivatives and their use as MALT1 inhibitors US Patent US9815842 Publication Date 11/14/2017
 
Mucosa-associated lymphoid tissue lymphoma translocation protein 1
Name:Mucosa-associated lymphoid tissue lymphoma translocation protein 1
Type:Enzyme
Mol. Mass.:92257.81
Organism:Homo sapiens (Human)
Description:Q9UDY8
Residue:824
BDBM355965
NameBDBM355965
Synonyms:(S)-1-(2-chloro-7-(1- methoxyethyl)pyrazo- lo[1,5-a]pyrimidin-6- yl)-3-(5- (difluoromethyl)-6- (2H-1,2,3-triazol-2- yl)pyridin-3-yl)urea US9815842, Example 89
TypeSmall organic molecule
Emp. Form.C18H16ClF2N9O2
Mol. Mass.463.829
SMILESCO[C@@H](C)c1c(NC(=O)Nc2cnc(c(c2)C(F)F)-n2nccn2)cnc2cc(Cl)nn12