Reaction Details
TargetMucosa-associated lymphoid tissue lymphoma translocation protein 1
LigandBDBM355971
Substrate/Competitorn/a
Meas. Tech.Biochemical Assay
IC50 0.002±n/a nM
Citation Soldermann, CPQuancard, JSchlapbach, ASimic, OTintelnot-Blomley, MZoller, T Pyrazolo pyrimidine derivatives and their use as MALT1 inhibitors US Patent US9815842 Publication Date 11/14/2017
 
Mucosa-associated lymphoid tissue lymphoma translocation protein 1
Name:Mucosa-associated lymphoid tissue lymphoma translocation protein 1
Type:Enzyme
Mol. Mass.:92257.81
Organism:Homo sapiens (Human)
Description:Q9UDY8
Residue:824
BDBM355971
NameBDBM355971
Synonyms:(S)-1-(5-chloro-6- (2H-1,2,3-triazol-2- yl)pyridin-3-yl)-3-(2- fluoro-7-(1- methoxyethyl)pyrazo- lo[1,5-a]pyrimidin-6- yl)urea US9815842, Example 95
TypeSmall organic molecule
Emp. Form.C17H15ClFN9O2
Mol. Mass.431.812
SMILESCO[C@@H](C)c1c(NC(=O)Nc2cnc(c(Cl)c2)-n2nccn2)cnc2cc(F)nn12