Reaction Details
TargetComplex of Baculoviral IAP repeat-containing protein 7 [1-159,S150G] and E3 ubiquitin-protein ligase XIAP [336-348]
LigandBDBM17346
Substrate/CompetitorBDBM17342
Meas. Tech.Fluorescence Polarization Affinity Measurements.
pH7.2±n/a
Temperature295.15±n/a K
Ki 190±n/a nM
Citation Zobel, KWang, LVarfolomeev, EFranklin, MCElliott, LOWallweber, HJOkawa, DCFlygare, JAVucic, DFairbrother, WJDeshayes, K Design, synthesis, and biological activity of a potent Smac mimetic that sensitizes cancer cells to apoptosis by antagonizing IAPs. ACS Chem Biol1:525-33 (2006) 
 
Complex of Baculoviral IAP repeat-containing protein 7 [1-159,S150G] and E3 ubiquitin-protein ligase XIAP [336-348]
Name:Complex of Baculoviral IAP repeat-containing protein 7 [1-159,S150G] and E3 ubiquitin-protein ligase XIAP [336-348]
Type:Chimeric Protein
Mol. Mass.:19011.07
Organism:Homo sapiens (Human)
Description:Amino acids 160-179 of MLBIR were replaced with amino acids 336-348 of XIAP-BIR3, and Ser150 of MLBIR was mutated to glycine to give MLXBIR3SG.
Residue:172
BDBM17346
BDBM17342
NameBDBM17346
Synonyms:(3R,6S,9aS)-2,2-dimethyl-N-(3-methyl-1-phenyl-1H-pyrazol-5-yl)-6-[(2S)-2-(methylamino)propanamido]-5-oxo-octahydroazepino[2,1-b][1,3]thiazole-3-carboxamide | peptide isostere, 9
TypeSmall organic molecule
Emp. Form.C25H34N6O3S
Mol. Mass.498.641
SMILES[H][C@]12CCC[C@H](NC(=O)[C@H](C)NC)C(=O)N1[C@H](C(=O)Nc1cc(C)nn1-c1ccccc1)C(C)(C)S2