Reaction Details
TargetBaculoviral IAP repeat-containing protein 2 [266-354]
LigandBDBM17347
Substrate/CompetitorBDBM17342
Meas. Tech.Fluorescence Polarization Affinity Measurements.
pH7.2±n/a
Temperature295.15±n/a K
Ki 110±n/a nM
Citation Zobel, KWang, LVarfolomeev, EFranklin, MCElliott, LOWallweber, HJOkawa, DCFlygare, JAVucic, DFairbrother, WJDeshayes, K Design, synthesis, and biological activity of a potent Smac mimetic that sensitizes cancer cells to apoptosis by antagonizing IAPs. ACS Chem Biol1:525-33 (2006) 
 
Baculoviral IAP repeat-containing protein 2 [266-354]
Name:Baculoviral IAP repeat-containing protein 2 [266-354]
Type:Chimeric Protein
Mol. Mass.:10496.31
Organism:Homo sapiens (Human)
Description:Q13490[266-354]
Residue:89
BDBM17347
BDBM17342
NameBDBM17347
Synonyms:(3R,6S,9aR)-N-(3-methyl-1-phenyl-1H-pyrazol-5-yl)-6-[(2S)-2-(methylamino)propanamido]-5-oxo-octahydroazepino[2,1-b][1,3]thiazole-3-carboxamide | peptide isostere, 10
TypeSmall organic molecule
Emp. Form.C23H30N6O3S
Mol. Mass.470.588
SMILES[H][C@@]12CCC[C@H](NC(=O)[C@H](C)NC)C(=O)N1[C@@H](CS2)C(=O)Nc1cc(C)nn1-c1ccccc1