Reaction Details
TargetMethionine aminopeptidase 2
LigandBDBM17360
Substrate/CompetitorBDBM17353
Meas. Tech.Enzyme Inhibition Assay
pH7.5±n/a
Temperature295.15±n/a K
Ki 3.7±n/a nM
Km300000±n/a nM
Citation Marino, JPFisher, PWHofmann, GAKirkpatrick, RBJanson, CAJohnson, RKMa, CMattern, MMeek, TDRyan, MDSchulz, CSmith, WWTew, DGTomazek, TAVeber, DFXiong, WCYamamoto, YYamashita, KYang, GThompson, SK Highly potent inhibitors of methionine aminopeptidase-2 based on a 1,2,4-triazole pharmacophore. J Med Chem50:3777-85 (2007) 
 
Methionine aminopeptidase 2
Name:Methionine aminopeptidase 2
Type:Enzyme
Mol. Mass.:52884.45
Organism:Homo sapiens (Human)
Description:P50579
Residue:478
BDBM17360
BDBM17353
NameBDBM17360
Synonyms:1,2,4-Triazole Compound, 18 | N-(2-methylphenyl)-5-[(pyridin-4-ylmethyl)sulfanyl]-4H-1,2,4-triazol-3-amine
TypeSmall organic molecule
Emp. Form.C15H15N5S
Mol. Mass.297.378
SMILESCc1ccccc1Nc1nnc(SCc2ccncc2)[nH]1