Reaction Details
TargetMethionine aminopeptidase 2
LigandBDBM17369
Substrate/CompetitorBDBM17353
Meas. Tech.Enzyme Inhibition Assay
pH7.5±n/a
Temperature295.15±n/a K
Ki 3.3±n/a nM
Km300000±n/a nM
Citation Marino, JPFisher, PWHofmann, GAKirkpatrick, RBJanson, CAJohnson, RKMa, CMattern, MMeek, TDRyan, MDSchulz, CSmith, WWTew, DGTomazek, TAVeber, DFXiong, WCYamamoto, YYamashita, KYang, GThompson, SK Highly potent inhibitors of methionine aminopeptidase-2 based on a 1,2,4-triazole pharmacophore. J Med Chem50:3777-85 (2007) 
 
Methionine aminopeptidase 2
Name:Methionine aminopeptidase 2
Type:Enzyme
Mol. Mass.:52884.45
Organism:Homo sapiens (Human)
Description:P50579
Residue:478
BDBM17369
BDBM17353
NameBDBM17369
Synonyms:1,2,4-Triazole Compound, 27 | 5-{[(3,4-difluorophenyl)methyl]sulfanyl}-N-(4-methylphenyl)-4H-1,2,4-triazol-3-amine
TypeSmall organic molecule
Emp. Form.C16H14F2N4S
Mol. Mass.332.371
SMILESCc1ccc(Nc2nnc(SCc3ccc(F)c(F)c3)[nH]2)cc1