Reaction Details
TargetMethionine aminopeptidase 2
LigandBDBM17375
Substrate/CompetitorBDBM17353
Meas. Tech.Enzyme Inhibition Assay
Ki 3.5±n/a nM
Citation Marino, JPFisher, PWHofmann, GAKirkpatrick, RBJanson, CAJohnson, RKMa, CMattern, MMeek, TDRyan, MDSchulz, CSmith, WWTew, DGTomazek, TAVeber, DFXiong, WCYamamoto, YYamashita, KYang, GThompson, SK Highly potent inhibitors of methionine aminopeptidase-2 based on a 1,2,4-triazole pharmacophore. J Med Chem50:3777-85 (2007) 
 
Methionine aminopeptidase 2
Name:Methionine aminopeptidase 2
Type:Enzyme
Mol. Mass.:52884.45
Organism:Homo sapiens (Human)
Description:P50579
Residue:478
BDBM17375
BDBM17353
NameBDBM17375
Synonyms:1,2,4-Triazole Compound, 33 | 5-{[(5-methyl-1,2-oxazol-3-yl)methyl]sulfanyl}-N-(4-methylphenyl)-4H-1,2,4-triazol-3-amine
TypeSmall organic molecule
Emp. Form.C14H15N5OS
Mol. Mass.301.367
SMILESCc1cc(CSc2nnc(Nc3ccc(C)cc3)[nH]2)no1