Reaction Details
TargetMethionine aminopeptidase 2
LigandBDBM17377
Substrate/CompetitorBDBM17353
Meas. Tech.Enzyme Inhibition Assay
Ki 0.43±n/a nM
Citation Marino, JPFisher, PWHofmann, GAKirkpatrick, RBJanson, CAJohnson, RKMa, CMattern, MMeek, TDRyan, MDSchulz, CSmith, WWTew, DGTomazek, TAVeber, DFXiong, WCYamamoto, YYamashita, KYang, GThompson, SK Highly potent inhibitors of methionine aminopeptidase-2 based on a 1,2,4-triazole pharmacophore. J Med Chem50:3777-85 (2007) 
 
Methionine aminopeptidase 2
Name:Methionine aminopeptidase 2
Type:Enzyme
Mol. Mass.:52884.45
Organism:Homo sapiens (Human)
Description:P50579
Residue:478
BDBM17377
BDBM17353
NameBDBM17377
Synonyms:1,2,4-Triazole Compound, 35 | 5-(benzylsulfanyl)-N-(4-chlorophenyl)-4H-1,2,4-triazol-3-amine
TypeSmall organic molecule
Emp. Form.C15H13ClN4S
Mol. Mass.316.809
SMILESClc1ccc(Nc2nnc(SCc3ccccc3)[nH]2)cc1