Reaction Details
TargetMethionine aminopeptidase 2
LigandBDBM17418
Substrate/CompetitorBDBM17353
Meas. Tech.Enzyme Inhibition Assay
Ki 0.8±n/a nM
Citation Marino, JPFisher, PWHofmann, GAKirkpatrick, RBJanson, CAJohnson, RKMa, CMattern, MMeek, TDRyan, MDSchulz, CSmith, WWTew, DGTomazek, TAVeber, DFXiong, WCYamamoto, YYamashita, KYang, GThompson, SK Highly potent inhibitors of methionine aminopeptidase-2 based on a 1,2,4-triazole pharmacophore. J Med Chem50:3777-85 (2007) 
 
Methionine aminopeptidase 2
Name:Methionine aminopeptidase 2
Type:Enzyme
Mol. Mass.:52884.45
Organism:Homo sapiens (Human)
Description:P50579
Residue:478
BDBM17418
BDBM17353
NameBDBM17418
Synonyms:1,2,4-Triazole Compound, 76 | methyl 4-[(5-{[(5-methyl-1,2-oxazol-3-yl)methyl]sulfanyl}-4H-1,2,4-triazol-3-yl)amino]benzoate
TypeSmall organic molecule
Emp. Form.C15H15N5O3S
Mol. Mass.345.376
SMILESCOC(=O)c1ccc(Nc2nnc(SCc3cc(C)on3)[nH]2)cc1