Reaction Details
TargetMethionine aminopeptidase 2
LigandBDBM17428
Substrate/CompetitorBDBM17353
Meas. Tech.Enzyme Inhibition Assay
Ki 0.04±n/a nM
Citation Marino, JPFisher, PWHofmann, GAKirkpatrick, RBJanson, CAJohnson, RKMa, CMattern, MMeek, TDRyan, MDSchulz, CSmith, WWTew, DGTomazek, TAVeber, DFXiong, WCYamamoto, YYamashita, KYang, GThompson, SK Highly potent inhibitors of methionine aminopeptidase-2 based on a 1,2,4-triazole pharmacophore. J Med Chem50:3777-85 (2007) 
 
Methionine aminopeptidase 2
Name:Methionine aminopeptidase 2
Type:Enzyme
Mol. Mass.:52884.45
Organism:Homo sapiens (Human)
Description:P50579
Residue:478
BDBM17428
BDBM17353
NameBDBM17428
Synonyms:1,2,4-Triazole Compound, 86 | N-[5-(benzylsulfanyl)-4H-1,2,4-triazol-3-yl]pyridin-3-amine
TypeSmall organic molecule
Emp. Form.C14H13N5S
Mol. Mass.283.352
SMILESC(Sc1nnc(Nc2cccnc2)[nH]1)c1ccccc1