Reaction Details
TargetMethionine aminopeptidase 2
LigandBDBM17443
Substrate/CompetitorBDBM17353
Meas. Tech.Enzyme Inhibition Assay
Ki 2±n/a nM
Citation Marino, JPFisher, PWHofmann, GAKirkpatrick, RBJanson, CAJohnson, RKMa, CMattern, MMeek, TDRyan, MDSchulz, CSmith, WWTew, DGTomazek, TAVeber, DFXiong, WCYamamoto, YYamashita, KYang, GThompson, SK Highly potent inhibitors of methionine aminopeptidase-2 based on a 1,2,4-triazole pharmacophore. J Med Chem50:3777-85 (2007) 
 
Methionine aminopeptidase 2
Name:Methionine aminopeptidase 2
Type:Enzyme
Mol. Mass.:52884.45
Organism:Homo sapiens (Human)
Description:P50579
Residue:478
BDBM17443
BDBM17353
NameBDBM17443
Synonyms:1,2,4-Triazole Compound, 102 SB-587094
TypeSmall organic molecule
Emp. Form.C16H18N4S2
Mol. Mass.330.471
SMILESCC(C)c1ccccc1Nc1nnc(SCc2cccs2)[nH]1