Reaction Details
TargetMethionine aminopeptidase 2
LigandBDBM17444
Substrate/CompetitorBDBM17353
Meas. Tech.Enzyme Inhibition Assay
Ki 3±n/a nM
Citation Marino, JPFisher, PWHofmann, GAKirkpatrick, RBJanson, CAJohnson, RKMa, CMattern, MMeek, TDRyan, MDSchulz, CSmith, WWTew, DGTomazek, TAVeber, DFXiong, WCYamamoto, YYamashita, KYang, GThompson, SK Highly potent inhibitors of methionine aminopeptidase-2 based on a 1,2,4-triazole pharmacophore. J Med Chem50:3777-85 (2007) 
 
Methionine aminopeptidase 2
Name:Methionine aminopeptidase 2
Type:Enzyme
Mol. Mass.:52884.45
Organism:Homo sapiens (Human)
Description:P50579
Residue:478
BDBM17444
BDBM17353
NameBDBM17444
Synonyms:1,2,4-Triazole Compound, 103 | 5-[(furan-2-ylmethyl)sulfanyl]-N-[2-(propan-2-yl)phenyl]-4H-1,2,4-triazol-3-amine
TypeSmall organic molecule
Emp. Form.C16H18N4OS
Mol. Mass.314.405
SMILESCC(C)c1ccccc1Nc1nnc(SCc2ccco2)[nH]1