Reaction Details
TargetHigh affinity nerve growth factor receptor
LigandBDBM356059
Substrate/Competitorn/a
Meas. Tech.Functional Activity Assay
IC50 0.230±n/a nM
Citation Mitchell, HFraley, MECooke, AJStump, CAChen, YZhang, XMcComas, CCSchirripa, KMcWherter, MMercer, SPBabaoglu, KMeng, DWu, JLiu, PWood, HBBao, JLi, CSMao, QQi, Z TrkA kinase inhibitors, compositions and methods thereof US Patent US9815846 Publication Date 11/14/2017
 
High affinity nerve growth factor receptor
Name:High affinity nerve growth factor receptor
Type:n/a
Mol. Mass.:87498.18
Organism:Homo sapiens (Human)
Description:P04629
Residue:796
BDBM356059
NameBDBM356059
Synonyms:2-fluoro-5-(1-methyl-1H- pyrazol-3-yl)-N-(6-((2- (methylsulfonyl)acetamido)methyl)- 2-phenylpyridin-3-yl)-4- (trifluoromethyl)benzamide | US9815846, Compound 59
TypeSmall organic molecule
Emp. Form.C27H23F4N5O4S
Mol. Mass.589.561
SMILESCn1ccc(n1)-c1cc(C(=O)Nc2ccc(CNC(=O)CS(C)(=O)=O)nc2-c2ccccc2)c(F)cc1C(F)(F)F