Reaction Details
TargetHigh affinity nerve growth factor receptor
LigandBDBM356097
Substrate/Competitorn/a
Meas. Tech.Functional Activity Assay
IC50 0.250±n/a nM
Citation Mitchell, HFraley, MECooke, AJStump, CAChen, YZhang, XMcComas, CCSchirripa, KMcWherter, MMercer, SPBabaoglu, KMeng, DWu, JLiu, PWood, HBBao, JLi, CSMao, QQi, Z TrkA kinase inhibitors, compositions and methods thereof US Patent US9815846 Publication Date 11/14/2017
 
High affinity nerve growth factor receptor
Name:High affinity nerve growth factor receptor
Type:n/a
Mol. Mass.:87498.18
Organism:Homo sapiens (Human)
Description:P04629
Residue:796
BDBM356097
NameBDBM356097
Synonyms:N-(2-((2,4-dioxooxazolidin-3- yl)methyl)-4-phenylpyrimidin-5- yl)-2-fluoro-5-(1-methyl-1H- pyrazol-3-yl)-4- (trifluoromethyl)benzamide | US9815846, Compound 97
TypeSmall organic molecule
Emp. Form.C26H18F4N6O4
Mol. Mass.554.4525
SMILESCn1ccc(n1)-c1cc(C(=O)Nc2cnc(CN3C(=O)COC3=O)nc2-c2ccccc2)c(F)cc1C(F)(F)F