Reaction Details
TargetHigh affinity nerve growth factor receptor
LigandBDBM356172
Substrate/Competitorn/a
Meas. Tech.Functional Activity Assay
IC50 0.260±n/a nM
Citation Mitchell, HFraley, MECooke, AJStump, CAChen, YZhang, XMcComas, CCSchirripa, KMcWherter, MMercer, SPBabaoglu, KMeng, DWu, JLiu, PWood, HBBao, JLi, CSMao, QQi, Z TrkA kinase inhibitors, compositions and methods thereof US Patent US9815846 Publication Date 11/14/2017
 
High affinity nerve growth factor receptor
Name:High affinity nerve growth factor receptor
Type:n/a
Mol. Mass.:87498.18
Organism:Homo sapiens (Human)
Description:P04629
Residue:796
BDBM356172
NameBDBM356172
Synonyms:2-fluoro-N-(5-(2- hydroxypropan-2-yl)-6'-phenyl- [2,3'-bipyridin]-5'-yl)-5-(1- methyl-1H-pyrazol-3-yl)-4- (trifluoromethyl)benzamide | US9815846, Compound 172
TypeSmall organic molecule
Emp. Form.C31H25F4N5O2
Mol. Mass.575.5561
SMILESCn1ccc(n1)-c1cc(C(=O)Nc2cc(cnc2-c2ccccc2)-c2ccc(cn2)C(C)(C)O)c(F)cc1C(F)(F)F