Reaction Details
TargetHigh affinity nerve growth factor receptor
LigandBDBM356196
Substrate/Competitorn/a
Meas. Tech.Functional Activity Assay
IC50 0.190±n/a nM
Citation Mitchell, HFraley, MECooke, AJStump, CAChen, YZhang, XMcComas, CCSchirripa, KMcWherter, MMercer, SPBabaoglu, KMeng, DWu, JLiu, PWood, HBBao, JLi, CSMao, QQi, Z TrkA kinase inhibitors, compositions and methods thereof US Patent US9815846 Publication Date 11/14/2017
 
High affinity nerve growth factor receptor
Name:High affinity nerve growth factor receptor
Type:n/a
Mol. Mass.:87498.18
Organism:Homo sapiens (Human)
Description:P04629
Residue:796
BDBM356196
NameBDBM356196
Synonyms:US9815846, Compound 196
TypeSmall organic molecule
Emp. Form.C26H19F4N5O3
Mol. Mass.525.4544
SMILESCn1ccc(n1)-c1cc(C(=O)Nc2ccc(nc2-c2ccccc2)C2COC(=O)N2)c(F)cc1C(F)(F)F