Reaction Details
TargetHigh affinity nerve growth factor receptor
LigandBDBM356218
Substrate/Competitorn/a
Meas. Tech.Functional Activity Assay
IC50 0.140±n/a nM
Citation Mitchell, HFraley, MECooke, AJStump, CAChen, YZhang, XMcComas, CCSchirripa, KMcWherter, MMercer, SPBabaoglu, KMeng, DWu, JLiu, PWood, HBBao, JLi, CSMao, QQi, Z TrkA kinase inhibitors, compositions and methods thereof US Patent US9815846 Publication Date 11/14/2017
 
High affinity nerve growth factor receptor
Name:High affinity nerve growth factor receptor
Type:n/a
Mol. Mass.:87498.18
Organism:Homo sapiens (Human)
Description:P04629
Residue:796
BDBM356218
NameBDBM356218
Synonyms:US9815846, Compound 218
TypeSmall organic molecule
Emp. Form.C26H20F4N6O3
Mol. Mass.540.469
SMILESCn1ccc(n1)-c1cc(C(=O)Nc2cnc(CN3CCOC3=O)nc2-c2ccccc2)c(F)cc1C(F)(F)F