Reaction Details
TargetProtein O-GlcNAcase
LigandBDBM205422
Substrate/Competitorn/a
Meas. Tech.Inhibition Assay
Ki 1.30±n/a nM
Citation Kaul, RMcEachern, EJMu, CSelnick, HGVocadlo, DJWang, YWei, ZZhou, YZhu, Y Selective glycosidase inhibitors and uses thereof US Patent US9815861 Publication Date 11/14/2017
 
Protein O-GlcNAcase
Name:Protein O-GlcNAcase
Type:Enzyme
Mol. Mass.:102874.67
Organism:Homo sapiens (Human)
Description:O60502
Residue:916
BDBM205422
NameBDBM205422
Synonyms:US9243020, 9 | US9815861, Example 9
TypeSmall organic molecule
Emp. Form.C8H13FN2O3S
Mol. Mass.236.264
SMILESCNC1=N[C@H]2[C@H](O[C@H](CO)[C@@H](O)[C@@H]2F)S1