Reaction Details
TargetCoagulation factor X
LigandBDBM17650
Substrate/CompetitorBDBM17640
Meas. Tech.In Vitro Assay for Inhibition of Factor Xa
pH7.4±n/a
Temperature295.15±n/a K
Ki>15800±n/a nM
Citation Chan, CBorthwick, ADBrown, DBurns-Kurtis, CLCampbell, MChaudry, LChung, CWConvery, MAHamblin, JNJohnstone, LKelly, HAKleanthous, SPatikis, APatel, CPateman, AJSenger, SShah, GPToomey, JRWatson, NSWeston, HEWhitworth, CYoung, RJZhou, P Factor Xa inhibitors: S1 binding interactions of a series of N-{(3S)-1-[(1S)-1-methyl-2-morpholin-4-yl-2-oxoethyl]-2-oxopyrrolidin-3-yl}sulfonamides. J Med Chem50:1546-57 (2007) 
 
Coagulation factor X
Name:Coagulation factor X
Type:Enzyme
Mol. Mass.:54726.60
Organism:Homo sapiens (Human)
Description:n/a
Residue:488
BDBM17650
BDBM17640
NameBDBM17650
Synonyms:5-(5-chloro-1,3,4-thiadiazol-2-yl)-N-[(3S)-1-[(2S)-1-(morpholin-4-yl)-1-oxopropan-2-yl]-2-oxopyrrolidin-3-yl]thiophene-2-sulfonamide | N-[(3S)-2-oxopyrrolidin-3-yl]sulfonamide, 1m
TypeSmall organic molecule
Emp. Form.C17H20ClN5O5S3
Mol. Mass.506.019
SMILESC[C@H](N1CC[C@H](NS(=O)(=O)c2ccc(s2)-c2nnc(Cl)s2)C1=O)C(=O)N1CCOCC1