Reaction Details
TargetApoptosis regulator Bcl-2
LigandBDBM189705
Substrate/Competitorn/a
Meas. Tech.TR-FRET (Time-Resolved Fluorescence-Resonance-Energy-Transfer) assay
Ki<0.010±n/a nM
Citation Catron, NLindley, DMiller, JMSchmitt, EATong, P Solid dispersions containing an apoptosis-inducing agent US Patent US10213433 Publication Date 2/26/2019
 
Apoptosis regulator Bcl-2
Name:Apoptosis regulator Bcl-2
Type:Homodimer or heterodimer
Mol. Mass.:26269.11
Organism:Homo sapiens (Human)
Description:P10415
Residue:239
BDBM189705
NameBDBM189705
Synonyms:US10213433, Compound 275 US9174982, 275
TypeSmall organic molecule
Emp. Form.C45H49ClN6O9S
Mol. Mass.885.423
SMILESCC1(C)CCC(CN2CCN(CC2)c2ccc(C(=O)NS(=O)(=O)c3ccc(OCCOC4CCOC4)c(c3)[N+]([O-])=O)c(Oc3cnc4[nH]ccc4c3)c2)=C(C1)c1ccc(Cl)cc1