Reaction Details
TargetApoptosis regulator Bcl-2
LigandBDBM356959
Substrate/Competitorn/a
Meas. Tech.TR-FRET (Time-Resolved Fluorescence-Resonance-Energy-Transfer) assay
Ki<0.010±n/a nM
Citation Catron, NLindley, DMiller, JMSchmitt, EATong, P Solid dispersions containing an apoptosis-inducing agent US Patent US10213433 Publication Date 2/26/2019
 
Apoptosis regulator Bcl-2
Name:Apoptosis regulator Bcl-2
Type:Homodimer or heterodimer
Mol. Mass.:26269.11
Organism:Homo sapiens (Human)
Description:P10415
Residue:239
BDBM356959
NameBDBM356959
Synonyms:N-[(5-chloro-6-{[(1R,2S,4R,5R)-5-hydroxy-5-methylbicyclo[2.2.1]hept-2-yl]methoxy}pyridin-3-yl)sulfonyl]-4-(4-{[2-(4-chlorophenyl)-4,4-dimethylcyclohex-1-en-1-yl]methyl}piperazin-1-yl)-2-(1H-pyrrolo[2,3-b]pyridin-5-yloxy)benzamide US11369599, Compound 343
TypeSmall organic molecule
Emp. Form.C47H52Cl2N6O6S
Mol. Mass.899.923
SMILESC[C@@]1(O)C[C@H]2C[C@@H]1C[C@@H]2COc1ncc(cc1Cl)S(=O)(=O)NC(=O)c1ccc(cc1Oc1cnc2[nH]ccc2c1)N1CCN(CC2=C(CC(C)(C)CC2)c2ccc(Cl)cc2)CC1