Reaction Details
TargetApoptosis regulator Bcl-2
LigandBDBM356966
Substrate/Competitorn/a
Meas. Tech.TR-FRET (Time-Resolved Fluorescence-Resonance-Energy-Transfer) assay
Ki<0.010±n/a nM
Citation Catron, NLindley, DMiller, JMSchmitt, EATong, P Solid dispersions containing an apoptosis-inducing agent US Patent US10213433 Publication Date 2/26/2019
 
Apoptosis regulator Bcl-2
Name:Apoptosis regulator Bcl-2
Type:Homodimer or heterodimer
Mol. Mass.:26269.11
Organism:Homo sapiens (Human)
Description:P10415
Residue:239
BDBM356966
NameBDBM356966
Synonyms:N-({5-chloro-6-[(cis-1-fluoro-4-hydroxycyclohexyl)methoxy]pyridin-3-yl}sulfonyl)-4-(4-{[2-(4-chlorophenyl)-4,4-dimethylcyclohex-1-en-1-yl]methyl}piperazin-1-yl)-2-(1H-pyrrolo[2,3-b]pyridin-5-yloxy)benzamide | US10213433, Compound 350
TypeSmall organic molecule
Emp. Form.C45H49Cl2FN6O6S
Mol. Mass.891.877
SMILESCC1(C)CCC(CN2CCN(CC2)c2ccc(C(=O)NS(=O)(=O)c3cnc(OC[C@@]4(F)CC[C@H](O)CC4)c(Cl)c3)c(Oc3cnc4[nH]ccc4c3)c2)=C(C1)c1ccc(Cl)cc1