Reaction Details
TargetApoptosis regulator Bcl-2
LigandBDBM189800
Substrate/Competitorn/a
Meas. Tech.TR-FRET (Time-Resolved Fluorescence-Resonance-Energy-Transfer) assay
Ki<0.001±n/a nM
Citation Catron, NLindley, DMiller, JMSchmitt, EATong, P Solid dispersions containing an apoptosis-inducing agent US Patent US10213433 Publication Date 2/26/2019
 
Apoptosis regulator Bcl-2
Name:Apoptosis regulator Bcl-2
Type:Homodimer or heterodimer
Mol. Mass.:26269.11
Organism:Homo sapiens (Human)
Description:P10415
Residue:239
BDBM189800
NameBDBM189800
Synonyms:US10213433, Compound 374 US9174982, 374
TypeSmall organic molecule
Emp. Form.C48H56ClN7O7S
Mol. Mass.910.519
SMILESCOCC1CCC(CNc2ccc(cc2[N+]([O-])=O)S(=O)(=O)NC(=O)c2ccc(cc2Oc2cnc3[nH]ccc3c2)N2CCN(CC3=C(CC(C)(C)CC3)c3ccc(Cl)cc3)CC2)CC1