Reaction Details
TargetAmine oxidase [flavin-containing] B
LigandBDBM254549
Substrate/Competitorn/a
Meas. Tech.Biological Assays-Inhibition of LSD1
Ki 20500±n/a nM
Citation Ortega Muñoz, AFyfe, MCMartinell Pedemonte, MEstiarte Martinez, MValls Vidal, NKurz, GCastro Palomino Laria, JC (Hetero)aryl cyclopropylamine compounds as LSD1 inhibitors US Patent US10214477 Publication Date 2/26/2019
 
Amine oxidase [flavin-containing] B
Name:Amine oxidase [flavin-containing] B
Type:Protein
Mol. Mass.:58768.76
Organism:Homo sapiens (Human)
Description:P27338
Residue:520
BDBM254549
NameBDBM254549
Synonyms:US10214477, Example 8 US9670136, 8 N1-((trans)-2-(6-(3-(trifluoromethyl)phenyl)pyridin-3-yl)cyclopropyl)cyclohexane-1,4-diamine
TypeSmall organic molecule
Emp. Form.C21H24F3N3
Mol. Mass.375.4306
SMILESNC1CCC(CC1)N[C@H]1C[C@@H]1c1ccc(nc1)-c1cccc(c1)C(F)(F)F