Reaction Details
TargetLysine-specific histone demethylase 1A
LigandBDBM254546
Substrate/Competitorn/a
Meas. Tech.Biological Assays-Inhibition of LSD1
IC50 17.0±n/a nM
Citation Ortega Muñoz, AFyfe, MCMartinell Pedemonte, MEstiarte Martinez, MValls Vidal, NKurz, GCastro Palomino Laria, JC (Hetero)aryl cyclopropylamine compounds as LSD1 inhibitors US Patent US10214477 Publication Date 2/26/2019
 
Lysine-specific histone demethylase 1A
Name:Lysine-specific histone demethylase 1A
Type:Enzyme
Mol. Mass.:92901.01
Organism:Homo sapiens (Human)
Description:O60341
Residue:852
BDBM254546
NameBDBM254546
Synonyms:US10214477, Example 3 US9670136, 5 (trans)-N1-((1R,2S)-2-phenylcyclopropyl)cyclohexane-1,4-diamine
TypeSmall organic molecule
Emp. Form.C15H22N2
Mol. Mass.230.3486
SMILESNC1CCC(CC1)N[C@H]1C[C@@H]1c1ccccc1