Reaction Details
TargetAmine oxidase [flavin-containing] B
LigandBDBM356626
Substrate/Competitorn/a
Meas. Tech.Biological Assays-Inhibition of LSD1
IC50 2500±n/a nM
Citation Ortega Muñoz, AFyfe, MCMartinell Pedemonte, MEstiarte Martinez, MValls Vidal, NKurz, GCastro Palomino Laria, JC (Hetero)aryl cyclopropylamine compounds as LSD1 inhibitors US Patent US10214477 Publication Date 2/26/2019
 
Amine oxidase [flavin-containing] B
Name:Amine oxidase [flavin-containing] B
Type:Protein
Mol. Mass.:58768.76
Organism:Homo sapiens (Human)
Description:P27338
Residue:520
BDBM356626
NameBDBM356626
Synonyms:US10214477, Example 12
TypeSmall organic molecule
Emp. Form.C23H26F3N3O2
Mol. Mass.433.4666
SMILESNC(=O)C1CCC(CC1)N[C@H]1C[C@@H]1c1ccc(OCc2cccc(c2)C(F)(F)F)nc1