Reaction Details
TargetSerine/threonine-protein kinase mTOR
LigandBDBM228207
Substrate/Competitorn/a
Meas. Tech. mTOR Kinase Activity Assay
IC50<10.00±n/a nM
Citation Zhang, XJi, QWang, LGao, CWang, EDu, ZGong, LChen, B Imidazolone derivatives, pharmaceutical compositions and uses thereof US Patent US10047084 Publication Date 8/14/2018
 
Serine/threonine-protein kinase mTOR
Name:Serine/threonine-protein kinase mTOR
Type:Rapamycin target protein
Mol. Mass.:288917.12
Organism:Homo sapiens (Human)
Description:P42345
Residue:2549
BDBM228207
NameBDBM228207
Synonyms:3-methyl-8-(6-(1-methyl-1H-pyrazol-4-yl)pyridin-3-yl)-1-(1-(methanesulfonyl)pyrrolidin-3-yl)-1H-imidazo[4,5-c]quinolin-2 (3H)-one | US10047084, 6
TypeSmall organic molecule
Emp. Form.C25H25N7O3S
Mol. Mass.503.576
SMILESCn1cc(cn1)-c1ccc(cn1)-c1ccc2ncc3n(C)c(=O)n(C4CCN(C4)S(C)(=O)=O)c3c2c1