Reaction Details
TargetSodium channel protein type 5 subunit alpha
LigandBDBM356998
Substrate/Competitorn/a
Meas. Tech.Nav1.7 and Nav1.5 Screening Assay
IC50>33000±n/a nM
Citation Duffy, JChambers, MSRae, AOsborne, JLemasson, IAGoldsmith, MDSharpe, AFonquerna Pou, S Amino-substituted heterocyclic derivatives as sodium channel inhibitors US Patent US10214509 Publication Date 2/26/2019
 
Sodium channel protein type 5 subunit alpha
Name:Sodium channel protein type 5 subunit alpha
Type:Enzyme
Mol. Mass.:226908.60
Organism:Homo sapiens (Human)
Description:Q14524
Residue:2016
BDBM356998
NameBDBM356998
Synonyms:5-Amino-1-(3-fluoro-2-methylphenyl)-N-(5-(trifluoromethoxy)pyridin-2-yl)-1H-pyrazole-4-carboxamide | US10214509, Example 55
TypeSmall organic molecule
Emp. Form.C17H13F4N5O2
Mol. Mass.395.311
SMILESCc1c(F)cccc1-n1ncc(C(=O)Nc2ccc(OC(F)(F)F)cn2)c1N