Reaction Details
TargetSodium channel protein type 5 subunit alpha
LigandBDBM357000
Substrate/Competitorn/a
Meas. Tech.Nav1.7 and Nav1.5 Screening Assay
IC50 28000±n/a nM
Citation Duffy, JChambers, MSRae, AOsborne, JLemasson, IAGoldsmith, MDSharpe, AFonquerna Pou, S Amino-substituted heterocyclic derivatives as sodium channel inhibitors US Patent US10214509 Publication Date 2/26/2019
 
Sodium channel protein type 5 subunit alpha
Name:Sodium channel protein type 5 subunit alpha
Type:Enzyme
Mol. Mass.:226908.60
Organism:Homo sapiens (Human)
Description:Q14524
Residue:2016
BDBM357000
NameBDBM357000
Synonyms:(5-Amino-1-(2-methoxyphenyl)-1H-pyrazol-4-yl)(5-chloroindolin-1-yl)methanone | US10214509, Example 61
TypeSmall organic molecule
Emp. Form.C19H17ClN4O2
Mol. Mass.368.817
SMILESCOc1ccccc1-n1ncc(C(=O)N2CCc3cc(Cl)ccc23)c1N