Reaction Details
TargetSodium channel protein type 9 subunit alpha
LigandBDBM357008
Substrate/Competitorn/a
Meas. Tech.Nav1.7 and Nav1.5 Screening Assay
IC50 700±n/a nM
Citation Duffy, JChambers, MSRae, AOsborne, JLemasson, IAGoldsmith, MDSharpe, AFonquerna Pou, S Amino-substituted heterocyclic derivatives as sodium channel inhibitors US Patent US10214509 Publication Date 2/26/2019
 
Sodium channel protein type 9 subunit alpha
Name:Sodium channel protein type 9 subunit alpha
Type:Protein
Mol. Mass.:226375.97
Organism:Homo sapiens (Human)
Description:Q15858
Residue:1988
BDBM357008
NameBDBM357008
Synonyms:5-Amino-N-(5-chloropyridin-2-yl)-1-(2-(pyridin-3-yl)phenyl)-1H-pyrazole-4-carboxamide | US10214509, Example 196
TypeSmall organic molecule
Emp. Form.C20H15ClN6O
Mol. Mass.390.826
SMILESNc1c(cnn1-c1ccccc1-c1cccnc1)C(=O)Nc1ccc(Cl)cn1