Reaction Details
TargetSodium channel protein type 5 subunit alpha
LigandBDBM357009
Substrate/Competitorn/a
Meas. Tech.Nav1.7 and Nav1.5 Screening Assay
IC50>33000±n/a nM
Citation Duffy, JChambers, MSRae, AOsborne, JLemasson, IAGoldsmith, MDSharpe, AFonquerna Pou, S Amino-substituted heterocyclic derivatives as sodium channel inhibitors US Patent US10214509 Publication Date 2/26/2019
 
Sodium channel protein type 5 subunit alpha
Name:Sodium channel protein type 5 subunit alpha
Type:Enzyme
Mol. Mass.:226908.60
Organism:Homo sapiens (Human)
Description:Q14524
Residue:2016
BDBM357009
NameBDBM357009
Synonyms:5-Amino-N-(5-chloropyridin-2-yl)-1-(2-(2-methoxypyridin-4-yl)phenyl)-1H-pyrazole-4-carboxamide | US10214509, Example 197
TypeSmall organic molecule
Emp. Form.C21H17ClN6O2
Mol. Mass.420.852
SMILESCOc1cc(ccn1)-c1ccccc1-n1ncc(C(=O)Nc2ccc(Cl)cn2)c1N