Reaction Details
TargetSodium channel protein type 9 subunit alpha
LigandBDBM357012
Substrate/Competitorn/a
Meas. Tech.Nav1.7 and Nav1.5 Screening Assay
IC50 1900±n/a nM
Citation Duffy, JChambers, MSRae, AOsborne, JLemasson, IAGoldsmith, MDSharpe, AFonquerna Pou, S Amino-substituted heterocyclic derivatives as sodium channel inhibitors US Patent US10214509 Publication Date 2/26/2019
 
Sodium channel protein type 9 subunit alpha
Name:Sodium channel protein type 9 subunit alpha
Type:Protein
Mol. Mass.:226375.97
Organism:Homo sapiens (Human)
Description:Q15858
Residue:1988
BDBM357012
NameBDBM357012
Synonyms:5-Amino-N-(4-chlorophenyl)-1-(2-methoxyphenyl)-1H-imidazole-4-carboxamide | US10214509, Example 254
TypeSmall organic molecule
Emp. Form.C17H15ClN4O2
Mol. Mass.342.78
SMILESCOc1ccccc1-n1cnc(C(=O)Nc2ccc(Cl)cc2)c1N