Reaction Details
TargetAurora kinase B
LigandBDBM357013
Substrate/Competitorn/a
Meas. Tech.Caliper Kinase Assay
IC50 50000±n/a nM
Citation Lloyd, JFinlay, HGunaga, PBanerjee, AAdisechan, A Quinazolines as potassium ion channel inhibitors US Patent US10214511 Publication Date 2/26/2019
 
Aurora kinase B
Name:Aurora kinase B
Type:Protein
Mol. Mass.:39327.72
Organism:Homo sapiens (Human)
Description:Q96GD4
Residue:344
BDBM357013
NameBDBM357013
Synonyms:5-Phenyl-N-(pyridin-2-ylmethyl)-2-(pyrimidin-5-yl)quinazolin-4-amine | US10214511, Example 1
TypeSmall organic molecule
Emp. Form.C42H30N10O
Mol. Mass.690.754
SMILESOc1nc(nc2cccc(-c3ccccc3)c12)-c1cncnc1.C(Nc1nc(nc2cccc(-c3ccccc3)c12)-c1cncnc1)c1ccccn1