Reaction Details
TargetSerine/threonine-protein kinase TBK1
LigandBDBM357013
Substrate/Competitorn/a
Meas. Tech.Caliper Kinase Assay
IC50 50000±n/a nM
Citation Lloyd, JFinlay, HGunaga, PBanerjee, AAdisechan, A Quinazolines as potassium ion channel inhibitors US Patent US10214511 Publication Date 2/26/2019
 
Serine/threonine-protein kinase TBK1
Name:Serine/threonine-protein kinase TBK1
Type:protein
Mol. Mass.:83645.20
Organism:Homo sapiens (Human)
Description:Q9UHD2
Residue:729
BDBM357013
NameBDBM357013
Synonyms:5-Phenyl-N-(pyridin-2-ylmethyl)-2-(pyrimidin-5-yl)quinazolin-4-amine | US10214511, Example 1
TypeSmall organic molecule
Emp. Form.C42H30N10O
Mol. Mass.690.754
SMILESOc1nc(nc2cccc(-c3ccccc3)c12)-c1cncnc1.C(Nc1nc(nc2cccc(-c3ccccc3)c12)-c1cncnc1)c1ccccn1