Reaction Details
TargetCoagulation factor XI
LigandBDBM357031
Substrate/Competitorn/a
Meas. Tech.Factor XIa Assay
Ki 0.220±n/a nM
Citation Xu, JAli, AZhou, WGao, YEdmondson, SDMertz, ENeelamkavil, SFLiu, WSun, WShen, DHarper, BZhu, CBara, TLim, YYang, M Factor XIA inhibitors US Patent US10214512 Publication Date 2/26/2019
 
Coagulation factor XI
Name:Coagulation factor XI
Type:Enzyme
Mol. Mass.:70130.58
Organism:Homo sapiens (Human)
Description:P03951
Residue:625
BDBM357031
NameBDBM357031
Synonyms:(Z)-5-(5-Chloro-2-(1H-tetrazol-1-yl)phenyl)-2-(25-fluoro-4-oxo-11h-3-aza -1(4,2)-imidazola-2(1,2)-benzenacyclononaphane-9-yl)pyridine 1-oxide | US10214512, Example 11-a
TypeSmall organic molecule
Emp. Form.C27H22ClFN8O2
Mol. Mass.544.967
SMILES[O-][n+]1cc(ccc1C1CCCCC(=O)Nc2ccc(F)cc2-c2c[nH]c1n2)-c1cc(Cl)ccc1-n1cnnn1