Reaction Details
TargetCoagulation factor XI
LigandBDBM357059
Substrate/Competitorn/a
Meas. Tech.Factor XIa Assay
Ki 0.260±n/a nM
Citation Xu, JAli, AZhou, WGao, YEdmondson, SDMertz, ENeelamkavil, SFLiu, WSun, WShen, DHarper, BZhu, CBara, TLim, YYang, M Factor XIA inhibitors US Patent US10214512 Publication Date 2/26/2019
 
Coagulation factor XI
Name:Coagulation factor XI
Type:Enzyme
Mol. Mass.:70130.58
Organism:Homo sapiens (Human)
Description:P03951
Residue:625
BDBM357059
NameBDBM357059
Synonyms:US10214512, Example 39
TypeSmall organic molecule
Emp. Form.C34H28ClF3N6O4
Mol. Mass.677.072
SMILESCOC(=O)Nc1ccc-2c(NC(=O)CCCC[C@@H](c3cccc-2c3)c2ccc(c[n+]2[O-])-c2cc(Cl)ccc2-n2cc(nn2)C(F)(F)F)c1