Reaction Details
TargetCoagulation factor XI
LigandBDBM357110
Substrate/Competitorn/a
Meas. Tech.Factor XIa Assay
Ki 0.140±n/a nM
Citation Xu, JAli, AZhou, WGao, YEdmondson, SDMertz, ENeelamkavil, SFLiu, WSun, WShen, DHarper, BZhu, CBara, TLim, YYang, M Factor XIA inhibitors US Patent US10214512 Publication Date 2/26/2019
 
Coagulation factor XI
Name:Coagulation factor XI
Type:Enzyme
Mol. Mass.:70130.58
Organism:Homo sapiens (Human)
Description:P03951
Residue:625
BDBM357110
NameBDBM357110
Synonyms:9-(5-(5-chloro-2-(1h-tetrazol-1-yl)phenyl)-1-oxidopyridin-2-yl)-15-fluoro-24-((methoxycarbonyl)amino)-4-oxo-3-aza-1(2,4)-pyridin-1-iuma -2(1,2)-benzenacyclononaphane 11-oxide | US10214512, Example 81-a
TypeSmall organic molecule
Emp. Form.C31H26ClFN8O5
Mol. Mass.645.04
SMILESCOC(=O)Nc1ccc-2c(NC(=O)CCCCC(c3cc-2[n+]([O-])cc3F)c2ccc(c[n+]2[O-])-c2cc(Cl)ccc2-n2cnnn2)c1