Reaction Details
TargetCoagulation factor XI
LigandBDBM357192
Substrate/Competitorn/a
Meas. Tech.Factor XIa Assay
Ki 0.140±n/a nM
Citation Xu, JAli, AZhou, WGao, YEdmondson, SDMertz, ENeelamkavil, SFLiu, WSun, WShen, DHarper, BZhu, CBara, TLim, YYang, M Factor XIA inhibitors US Patent US10214512 Publication Date 2/26/2019
 
Coagulation factor XI
Name:Coagulation factor XI
Type:Enzyme
Mol. Mass.:70130.58
Organism:Homo sapiens (Human)
Description:P03951
Residue:625
BDBM357192
NameBDBM357192
Synonyms:US10214512, Example 145-a
TypeSmall organic molecule
Emp. Form.C32H31F2N5O4
Mol. Mass.587.6164
SMILESCOC(=O)Nc1ccc2-c3nc([nH]c3C3CC3)[C@H](CCC[C@@H](C)C(=O)Nc2c1)c1ccc(c[n+]1[O-])-c1c(F)cccc1F