Reaction Details
TargetCoagulation factor XI
LigandBDBM357214
Substrate/Competitorn/a
Meas. Tech.Factor XIa Assay
Ki 0.090±n/a nM
Citation Xu, JAli, AZhou, WGao, YEdmondson, SDMertz, ENeelamkavil, SFLiu, WSun, WShen, DHarper, BZhu, CBara, TLim, YYang, M Factor XIA inhibitors US Patent US10214512 Publication Date 2/26/2019
 
Coagulation factor XI
Name:Coagulation factor XI
Type:Enzyme
Mol. Mass.:70130.58
Organism:Homo sapiens (Human)
Description:P03951
Residue:625
BDBM357214
NameBDBM357214
Synonyms:US10214512, Example 152-a
TypeSmall organic molecule
Emp. Form.C31H30F3N5O5
Mol. Mass.609.5956
SMILESCOC(=O)Nc1ccc2-c3nc([nH]c3C)[C@H](C[C@H](C)CCC(=O)Nc2c1)c1ccc(c[n+]1[O-])-c1c(F)cccc1OC(F)F