Reaction Details
TargetCoagulation factor XI
LigandBDBM357231
Substrate/Competitorn/a
Meas. Tech.Factor XIa Assay
Ki 0.140±n/a nM
Citation Xu, JAli, AZhou, WGao, YEdmondson, SDMertz, ENeelamkavil, SFLiu, WSun, WShen, DHarper, BZhu, CBara, TLim, YYang, M Factor XIA inhibitors US Patent US10214512 Publication Date 2/26/2019
 
Coagulation factor XI
Name:Coagulation factor XI
Type:Enzyme
Mol. Mass.:70130.58
Organism:Homo sapiens (Human)
Description:P03951
Residue:625
BDBM357231
NameBDBM357231
Synonyms:US10214512, Example 166-a
TypeSmall organic molecule
Emp. Form.C30H25Cl2F2N7O2
Mol. Mass.624.468
SMILESC[C@@H]1CCC[C@@H](c2cccc(c2)-c2c(NC1=O)cnn2C(F)F)c1ccc(c[n+]1[O-])-c1cc(Cl)ccc1-n1cc(Cl)nn1