Reaction Details
TargetKallikrein-1
LigandBDBM357065
Substrate/Competitorn/a
Meas. Tech.Kallikrein Assay
Ki 0.440±n/a nM
Citation Xu, JAli, AZhou, WGao, YEdmondson, SDMertz, ENeelamkavil, SFLiu, WSun, WShen, DHarper, BZhu, CBara, TLim, YYang, M Factor XIA inhibitors US Patent US10214512 Publication Date 2/26/2019
 
Kallikrein-1
Name:Kallikrein-1
Type:Enzyme
Mol. Mass.:28874.69
Organism:Homo sapiens (Human)
Description:P06870
Residue:262
BDBM357065
NameBDBM357065
Synonyms:(S)-2-(24-(((2-(tert-butoxy)ethoxy)carbonyl)amino)-4-oxo-3-aza -1(1,3),2(1,2)-dinenzenacyclononaphane-9-yl)-5-(3-chloro-2,6-difluorophenyl)pyridine 1-oxide | US10214512, Example 45
TypeSmall organic molecule
Emp. Form.C36H36ClF2N3O5
Mol. Mass.664.138
SMILESCC(C)(C)OCCOC(=O)Nc1ccc-2c(NC(=O)CCCC[C@@H](c3cccc-2c3)c2ccc(c[n+]2[O-])-c2c(F)ccc(Cl)c2F)c1