Reaction Details
TargetKallikrein-1
LigandBDBM357075
Substrate/Competitorn/a
Meas. Tech.Kallikrein Assay
Ki 1.43±n/a nM
Citation Xu, JAli, AZhou, WGao, YEdmondson, SDMertz, ENeelamkavil, SFLiu, WSun, WShen, DHarper, BZhu, CBara, TLim, YYang, M Factor XIA inhibitors US Patent US10214512 Publication Date 2/26/2019
 
Kallikrein-1
Name:Kallikrein-1
Type:Enzyme
Mol. Mass.:28874.69
Organism:Homo sapiens (Human)
Description:P06870
Residue:262
BDBM357075
NameBDBM357075
Synonyms:5-(5-chloro-2-(1h-tetrazol-1-yl)phenyl)-2-(15-fluoro-24-((methoxycarbonyl)amino)-4-oxo-3-aza-1(1,3),2(1,2) -dinenzenacyclononaphane-9-yl)pyridine 1-oxide | US10214512, Example 52
TypeSmall organic molecule
Emp. Form.C32H27ClFN7O4
Mol. Mass.628.053
SMILESCOC(=O)Nc1ccc-2c(NC(=O)CCCCC(c3cc(F)cc-2c3)c2ccc(c[n+]2[O-])-c2cc(Cl)ccc2-n2cnnn2)c1