Reaction Details
TargetKallikrein-1
LigandBDBM357094
Substrate/Competitorn/a
Meas. Tech.Kallikrein Assay
Ki 0.330±n/a nM
Citation Xu, JAli, AZhou, WGao, YEdmondson, SDMertz, ENeelamkavil, SFLiu, WSun, WShen, DHarper, BZhu, CBara, TLim, YYang, M Factor XIA inhibitors US Patent US10214512 Publication Date 2/26/2019
 
Kallikrein-1
Name:Kallikrein-1
Type:Enzyme
Mol. Mass.:28874.69
Organism:Homo sapiens (Human)
Description:P06870
Residue:262
BDBM357094
NameBDBM357094
Synonyms:US10214512, Example 71
TypeSmall organic molecule
Emp. Form.C31H26ClFN8O4
Mol. Mass.629.041
SMILESCOC(=O)Nc1ccc-2c(NC(=O)CCCC[C@@H](c3cc-2ncc3F)c2ccc(c[n+]2[O-])-c2cc(Cl)ccc2-n2cnnn2)c1