Reaction Details
TargetKallikrein-1
LigandBDBM357100
Substrate/Competitorn/a
Meas. Tech.Kallikrein Assay
Ki 1.50±n/a nM
Citation Xu, JAli, AZhou, WGao, YEdmondson, SDMertz, ENeelamkavil, SFLiu, WSun, WShen, DHarper, BZhu, CBara, TLim, YYang, M Factor XIA inhibitors US Patent US10214512 Publication Date 2/26/2019
 
Kallikrein-1
Name:Kallikrein-1
Type:Enzyme
Mol. Mass.:28874.69
Organism:Homo sapiens (Human)
Description:P06870
Residue:262
BDBM357100
NameBDBM357100
Synonyms:5-(3-chloro-2,6-difluorophenyl)-2-((5S,9S)-15-fluoro-24- ((methoxycarbonyl)amino)-5-methyl-4-oxo-3-aza-1(2,4)-pyridina-2(1,2)- benzenacyclononaphane-9-yl)pyridine 1-oxide | US10214512, Example 76-b
TypeSmall organic molecule
Emp. Form.C31H26ClF3N4O4
Mol. Mass.611.011
SMILESCOC(=O)Nc1ccc-2c(NC(=O)[C@@H](C)CCC[C@@H](c3cc-2ncc3F)c2ccc(c[n+]2[O-])-c2c(F)ccc(Cl)c2F)c1