Reaction Details
TargetKallikrein-1
LigandBDBM357141
Substrate/Competitorn/a
Meas. Tech.Kallikrein Assay
Ki 1.02±n/a nM
Citation Xu, JAli, AZhou, WGao, YEdmondson, SDMertz, ENeelamkavil, SFLiu, WSun, WShen, DHarper, BZhu, CBara, TLim, YYang, M Factor XIA inhibitors US Patent US10214512 Publication Date 2/26/2019
 
Kallikrein-1
Name:Kallikrein-1
Type:Enzyme
Mol. Mass.:28874.69
Organism:Homo sapiens (Human)
Description:P06870
Residue:262
BDBM357141
NameBDBM357141
Synonyms:(Z)-5-(3-Chloro-6-(difluoromethoxy)-2-fluorophenyl)-2-(24-((methoxycarbonyl)amino)-4-oxo-11H-3-aza-1(4,2)-imidazola-2(1,2) -benzenacyclononaphane-9-yl)pyridine 1-oxide | US10214512, Example 100-a
TypeSmall organic molecule
Emp. Form.C29H25ClF3N5O5
Mol. Mass.615.988
SMILESCOC(=O)Nc1ccc2-c3c[nH]c(n3)C(CCCCC(=O)Nc2c1)c1ccc(c[n+]1[O-])-c1c(F)c(Cl)ccc1OC(F)F