Reaction Details
TargetKallikrein-1
LigandBDBM357164
Substrate/Competitorn/a
Meas. Tech.Kallikrein Assay
Ki 0.780±n/a nM
Citation Xu, JAli, AZhou, WGao, YEdmondson, SDMertz, ENeelamkavil, SFLiu, WSun, WShen, DHarper, BZhu, CBara, TLim, YYang, M Factor XIA inhibitors US Patent US10214512 Publication Date 2/26/2019
 
Kallikrein-1
Name:Kallikrein-1
Type:Enzyme
Mol. Mass.:28874.69
Organism:Homo sapiens (Human)
Description:P06870
Residue:262
BDBM357164
NameBDBM357164
Synonyms:US10214512, Example 120
TypeSmall organic molecule
Emp. Form.C30H27F3N4O4
Mol. Mass.564.555
SMILESCOC(=O)Nc1ccc2-c3nc([nH]c3C)[C@H](CCCCC(=O)Cc2c1)c1ccc(c[n+]1[O-])-c1c(F)ccc(F)c1F